{"text_format":"1","workbook":"xlsx","n_sheets":3,"sheets":["Data","Multiselect ListBox","Junk"],"not_rendered":{"charts":1,"images":0,"macros":1,"external_links":0,"defined_names":3,"comments":0,"pivot_tables":0},"unopened":[],"bounds":{"document_bytes":16777216,"sheet_cells":100000,"rows_first":2000,"rows_last":500,"rows_between":2000,"halvings":0,"cell_chars":16384,"cell_head_chars":4096},"cells_cut":0,"cells_raw":0,"read":"whole","date_system":"1900"}

{"sheet":"Data","index":0,"n_rows":16,"n_cols":13,"rows_kept":16,"cut":false,"hidden":false,"merged":[]}
[null,"Production in KGs",null,null,null,null,null,null,0,null,null,0]
["FRUITS",2010,2011,2012,2013,2014,2015]
["Orange",10000,12000,10320,9597.6,9021.7440000000006,10104.353280000001]
["Apples",11800,11682,9345.6,9158.6880000000001,9067.1011199999994,9429.7851647999996]
["Bananas",9676,9192.2000000000007,8456.8240000000005,7780.278080000001,8791.7142304000008,9231.2999419200005]
["Grapes",7837.56,8072.6868000000004,9202.8629520000013,10491.263765280002,10491.263765280002,11330.564866502402]
["Mangoes",5878.17,6818.6772000000001,6273.1830240000008,7151.4286473600005,7938.0857985696011,8017.466656555297]
[]
[]
[]
[]
[]
[]
[null,null,{"$f":"IFERROR(INDEX(data,MATCH($B14,fruits,0),MATCH('Multiselect ListBox'!C$4,years,0)),\"\")","v":""},{"$f":"IFERROR(INDEX(data,MATCH($B14,fruits,0),MATCH('Multiselect ListBox'!D$4,years,0)),\"\")","v":""},{"$f":"IFERROR(INDEX(data,MATCH($B14,fruits,0),MATCH('Multiselect ListBox'!E$4,years,0)),\"\")","v":""},{"$f":"IFERROR(INDEX(data,MATCH($B14,fruits,0),MATCH('Multiselect ListBox'!F$4,years,0)),\"\")","v":""},{"$f":"IFERROR(INDEX(data,MATCH($B14,fruits,0),MATCH('Multiselect ListBox'!G$4,years,0)),\"\")","v":""},{"$f":"IFERROR(INDEX(data,MATCH($B14,fruits,0),MATCH('Multiselect ListBox'!H$4,years,0)),\"\")","v":""}]
[null,null,{"$f":"IFERROR(INDEX(data,MATCH($B15,fruits,0),MATCH('Multiselect ListBox'!C$4,years,0)),\"\")","v":""},{"$f":"IFERROR(INDEX(data,MATCH($B15,fruits,0),MATCH('Multiselect ListBox'!D$4,years,0)),\"\")","v":""},{"$f":"IFERROR(INDEX(data,MATCH($B15,fruits,0),MATCH('Multiselect ListBox'!E$4,years,0)),\"\")","v":""},{"$f":"IFERROR(INDEX(data,MATCH($B15,fruits,0),MATCH('Multiselect ListBox'!F$4,years,0)),\"\")","v":""},{"$f":"IFERROR(INDEX(data,MATCH($B15,fruits,0),MATCH('Multiselect ListBox'!G$4,years,0)),\"\")","v":""},{"$f":"IFERROR(INDEX(data,MATCH($B15,fruits,0),MATCH('Multiselect ListBox'!H$4,years,0)),\"\")","v":""}]
[null,null,null,null,null,null,null,null,null,null,null,null,"m"]

{"sheet":"Multiselect ListBox","index":1,"n_rows":9,"n_cols":8,"rows_kept":9,"cut":false,"hidden":false,"merged":[]}
[]
[]
[null,"MY SELECTED FRUITS"]
[null,null,2010,2011,2012,2013,2014,2015]
[null,"Orange",{"$f":"IFERROR(INDEX(data,MATCH($B5,fruits,0),MATCH(C$4,years,0)),\"\")","v":10000},12000,10320,9597.6,9021.7440000000006,10104.353280000001]
[null,"Grapes",7837.56,8072.6868000000004,9202.8629520000013,10491.263765280002,10491.263765280002,11330.564866502402]
[null,null,"","","","","",""]
[null,null,"","","","","",""]
[null,null,"","","","","",""]

{"sheet":"Junk","index":2,"n_rows":8,"n_cols":7,"rows_kept":8,"cut":false,"hidden":true,"merged":[]}
[]
[]
["FRUITS",2010,2011,2012,2013,2014,2015]
["Orange",{"$f":"10000","v":10000},{"$f":"B4*RANDBETWEEN(80,120)/100","v":9300},{"$f":"C4*RANDBETWEEN(80,120)/100","v":7533},8512.2900000000009,8682.5358000000015,8508.8850840000014]
["Apples",{"$f":"B4*RANDBETWEEN(70,130)/100","v":8100},{"$f":"B5*RANDBETWEEN(80,120)/100","v":8910},8999.1,8189.1809999999996,9253.7745300000006,8328.3970769999996]
["Bananas",{"$f":"B5*RANDBETWEEN(70,130)/100","v":5670},4762.8,4286.5200000000004,3429.2160000000003,3052.0022400000003,3662.4026880000001]
["Grapes",6690.6,5820.822000000001,6693.9453000000012,5355.1562400000003,5301.6046776000003,4400.3318824080006]
["Mangoes",5419.3859999999995,6340.6816199999994,6594.3088847999998,7385.6259509760002,8050.3322865638402,7164.7957350418183]